Reaction Details
TargetHistone deacetylase 3
LigandBDBM323720
Substrate/Competitorn/a
Meas. Tech.HDAC Inhibition Assay
IC50 0.540±n/a nM
Citation Hooker, JMWang, CSchroeder, FA Imaging histone deacetylases with a radiotracer using positron emission tomography US Patent US10188756 Publication Date 1/29/2019
 
Histone deacetylase 3
Name:Histone deacetylase 3
Type:Enzyme
Mol. Mass.:48829.55
Organism:Homo sapiens (Human)
Description:O15379
Residue:428
BDBM323720
NameBDBM323720
Synonyms:US10188756, Compound CN166
TypeSmall organic molecule
Emp. Form.C17H23FN2O2
Mol. Mass.306.3751
SMILESONC(=O)\C=C\c1ccc(CNCC2CCCCC2)c(F)c1