Reaction Details
TargetCoagulation factor IX
LigandBDBM324180
Substrate/Competitorn/a
Meas. Tech.Determination of Inhibitory Activity Against Factor IXa
IC50 14.8±n/a nM
Citation Zhang, TChen, YGuo, LHruza, AJian, TLi, BMeng, DParker, DLSherer, ECWood, HBSakurada, I Factor IXa inhibitors US Patent US10189819 Publication Date 1/29/2019
 
Coagulation factor IX
Name:Coagulation factor IX
Type:Enzyme
Mol. Mass.:51768.83
Organism:Homo sapiens (Human)
Description:P00740
Residue:461
BDBM324180
NameBDBM324180
Synonyms:US10189819, Example 9
TypeSmall organic molecule
Emp. Form.C27H25ClN6O2
Mol. Mass.500.979
SMILESCOc1cc(cc(Cl)c1C(=O)NCC(c1nc2cc(C)c(C)cc2[nH]1)c1ccccc1)-n1cnnc1