Reaction Details
TargetCoagulation factor IX
LigandBDBM324210
Substrate/Competitorn/a
Meas. Tech.Determination of Inhibitory Activity Against Factor IXa
IC50 6.18±n/a nM
Citation Zhang, TChen, YGuo, LHruza, AJian, TLi, BMeng, DParker, DLSherer, ECWood, HBSakurada, I Factor IXa inhibitors US Patent US10189819 Publication Date 1/29/2019
 
Coagulation factor IX
Name:Coagulation factor IX
Type:Enzyme
Mol. Mass.:51768.83
Organism:Homo sapiens (Human)
Description:P00740
Residue:461
BDBM324210
NameBDBM324210
Synonyms:US10189819, Example 47
TypeSmall organic molecule
Emp. Form.C26H20Cl3FN6O
Mol. Mass.557.834
SMILESCc1ncn(n1)-c1cc(Cl)c(C(=O)NCC(c2nc3c(C)cc(Cl)cc3[nH]2)c2cccc(F)c2)c(Cl)c1