Reaction Details
TargetCoagulation factor IX
LigandBDBM324216
Substrate/Competitorn/a
Meas. Tech.Determination of Inhibitory Activity Against Factor IXa
IC50 2.82±n/a nM
Citation Zhang, TChen, YGuo, LHruza, AJian, TLi, BMeng, DParker, DLSherer, ECWood, HBSakurada, I Factor IXa inhibitors US Patent US10189819 Publication Date 1/29/2019
 
Coagulation factor IX
Name:Coagulation factor IX
Type:Enzyme
Mol. Mass.:51768.83
Organism:Homo sapiens (Human)
Description:P00740
Residue:461
BDBM324216
NameBDBM324216
Synonyms:US10189819, Example 53
TypeSmall organic molecule
Emp. Form.C26H21Cl2FN6O
Mol. Mass.523.389
SMILESCc1cc2nc([nH]c2cc1C)C(CNC(=O)c1c(Cl)cc(cc1Cl)-n1cnnc1)c1ccc(F)cc1