Reaction Details
TargetCoagulation factor IX
LigandBDBM324219
Substrate/Competitorn/a
Meas. Tech.Determination of Inhibitory Activity Against Factor IXa
IC50 15.3±n/a nM
Citation Zhang, TChen, YGuo, LHruza, AJian, TLi, BMeng, DParker, DLSherer, ECWood, HBSakurada, I Factor IXa inhibitors US Patent US10189819 Publication Date 1/29/2019
 
Coagulation factor IX
Name:Coagulation factor IX
Type:Enzyme
Mol. Mass.:51768.83
Organism:Homo sapiens (Human)
Description:P00740
Residue:461
BDBM324219
NameBDBM324219
Synonyms:US10189819, Example 56
TypeSmall organic molecule
Emp. Form.C25H22ClN7O
Mol. Mass.471.941
SMILESCc1cc2nc([nH]c2cc1C)C(CNC(=O)c1ccc(cc1Cl)-n1cnnc1)c1cccnc1