Reaction Details
TargetCoagulation factor IX
LigandBDBM324224
Substrate/Competitorn/a
Meas. Tech.Determination of Inhibitory Activity Against Factor IXa
IC50 4.78±n/a nM
Citation Zhang, TChen, YGuo, LHruza, AJian, TLi, BMeng, DParker, DLSherer, ECWood, HBSakurada, I Factor IXa inhibitors US Patent US10189819 Publication Date 1/29/2019
 
Coagulation factor IX
Name:Coagulation factor IX
Type:Enzyme
Mol. Mass.:51768.83
Organism:Homo sapiens (Human)
Description:P00740
Residue:461
BDBM324224
NameBDBM324224
Synonyms:US10189819, Example 61
TypeSmall organic molecule
Emp. Form.C28H24Cl3N7O3
Mol. Mass.612.894
SMILESCNC(=O)c1cccc(c1)[C@H](CNC(=O)c1c(Cl)cc(cc1Cl)-n1cnc(C)n1)c1nc2cc(OC)c(Cl)cc2[nH]1