Reaction Details
TargetCoagulation factor IX
LigandBDBM324253
Substrate/Competitorn/a
Meas. Tech.Determination of Inhibitory Activity Against Factor IXa
IC50 7.30±n/a nM
Citation Zhang, TChen, YGuo, LHruza, AJian, TLi, BMeng, DParker, DLSherer, ECWood, HBSakurada, I Factor IXa inhibitors US Patent US10189819 Publication Date 1/29/2019
 
Coagulation factor IX
Name:Coagulation factor IX
Type:Enzyme
Mol. Mass.:51768.83
Organism:Homo sapiens (Human)
Description:P00740
Residue:461
BDBM324253
NameBDBM324253
Synonyms:US10189819, Example 107
TypeSmall organic molecule
Emp. Form.C29H24ClF2N5O3
Mol. Mass.563.982
SMILESCc1ccc(F)c2nc([nH]c(=O)c12)[C@@H](CNC(=O)c1ccc(cc1Cl)-n1cnc(CCO)c1)c1cccc(F)c1