Reaction Details
TargetCoagulation factor IX
LigandBDBM324254
Substrate/Competitorn/a
Meas. Tech.Determination of Inhibitory Activity Against Factor IXa
IC50 9.20±n/a nM
Citation Zhang, TChen, YGuo, LHruza, AJian, TLi, BMeng, DParker, DLSherer, ECWood, HBSakurada, I Factor IXa inhibitors US Patent US10189819 Publication Date 1/29/2019
 
Coagulation factor IX
Name:Coagulation factor IX
Type:Enzyme
Mol. Mass.:51768.83
Organism:Homo sapiens (Human)
Description:P00740
Residue:461
BDBM324254
NameBDBM324254
Synonyms:US10189819, Example 108
TypeSmall organic molecule
Emp. Form.C30H23ClF2N4O3
Mol. Mass.560.978
SMILESCc1ccc(F)c2nc([nH]c(=O)c12)[C@@H](CNC(=O)c1ccc(cc1Cl)-c1ccc(=O)n(C)c1)c1cccc(F)c1