Reaction Details
TargetCoagulation factor IX
LigandBDBM324255
Substrate/Competitorn/a
Meas. Tech.Determination of Inhibitory Activity Against Factor IXa
IC50 1.80±n/a nM
Citation Zhang, TChen, YGuo, LHruza, AJian, TLi, BMeng, DParker, DLSherer, ECWood, HBSakurada, I Factor IXa inhibitors US Patent US10189819 Publication Date 1/29/2019
 
Coagulation factor IX
Name:Coagulation factor IX
Type:Enzyme
Mol. Mass.:51768.83
Organism:Homo sapiens (Human)
Description:P00740
Residue:461
BDBM324255
NameBDBM324255
Synonyms:US10189819, Example 109
TypeSmall organic molecule
Emp. Form.C27H21ClF2N6O3
Mol. Mass.550.944
SMILESCc1ccc(F)c2nc([nH]c(=O)c12)[C@@H](CNC(=O)c1ccc(cc1Cl)-n1cnn(C)c1=O)c1cccc(F)c1