Reaction Details
TargetSerine/threonine-protein kinase B-raf [416-766,V600E]
LigandBDBM186817
Substrate/Competitorn/a
Meas. Tech.Raf IC50 Assay
Temperature298.15±n/a K
IC50 9500±n/a nM
Commentsextracted
Citation Zhou, CZhang, G Fused tricyclic urea compounds as Raf kinase and/or Raf kinase dimer inhibitors US Patent US9670203 Publication Date 6/6/2017
 
Serine/threonine-protein kinase B-raf [416-766,V600E]
Name:Serine/threonine-protein kinase B-raf [416-766,V600E]
Type:n/a
Mol. Mass.:39690.71
Organism:Homo sapiens (Human)
Description:PV3849, from Invitrogen
Residue:351
BDBM186817
NameBDBM186817
Synonyms:US9670203, Compound 1.9
TypeSmall organic molecule
Emp. Form.C25H18ClF3N4O4
Mol. Mass.530.883
SMILESFC(F)(F)c1cc(Cl)ccc1NC(=O)N[C@@H]1[C@H]2Oc3ccc(Oc4ccnc5NC(=O)CCc45)cc3[C@@H]12