Reaction Details
TargetSerine/threonine-protein kinase B-raf [416-766,V600E]
LigandBDBM186820
Substrate/Competitorn/a
Meas. Tech.Raf IC50 Assay
Temperature298.15±n/a K
IC50 4700±n/a nM
Commentsextracted
Citation Zhou, CZhang, G Fused tricyclic urea compounds as Raf kinase and/or Raf kinase dimer inhibitors US Patent US9670203 Publication Date 6/6/2017
 
Serine/threonine-protein kinase B-raf [416-766,V600E]
Name:Serine/threonine-protein kinase B-raf [416-766,V600E]
Type:n/a
Mol. Mass.:39690.71
Organism:Homo sapiens (Human)
Description:PV3849, from Invitrogen
Residue:351
BDBM186820
NameBDBM186820
Synonyms:US9670203, Compound 1.12
TypeSmall organic molecule
Emp. Form.C25H18F4N4O4
Mol. Mass.514.4284
SMILESFc1c(NC(=O)N[C@@H]2[C@H]3Oc4ccc(Oc5ccnc6NC(=O)CCc56)cc4[C@@H]23)cccc1C(F)(F)F