Reaction Details
TargetDipeptidyl peptidase 4
LigandBDBM11536
Substrate/CompetitorBDBM11526
Meas. Tech.In Vitro DPP-IV Inhibition Assays
pH7.4±n/a
Temperature295.15±n/a K
Ki 21±0.6 nM
Citation Augeri, DJRobl, JABetebenner, DAMagnin, DRKhanna, ARobertson, JGWang, ASimpkins, LMTaunk, PHuang, QHan, SPAbboa-Offei, BCap, MXin, LTao, LTozzo, EWelzel, GEEgan, DMMarcinkeviciene, JChang, SYBiller, SAKirby, MSParker, RAHamann, LG Discovery and preclinical profile of Saxagliptin (BMS-477118): a highly potent, long-acting, orally active dipeptidyl peptidase IV inhibitor for the treatment of type 2 diabetes. J Med Chem48:5025-37 (2005) 
 
Dipeptidyl peptidase 4
Name:Dipeptidyl peptidase 4
Type:Enzyme
Mol. Mass.:88271.01
Organism:Homo sapiens (Human)
Description:P27487
Residue:766
BDBM11536
BDBM11526
NameBDBM11536
Synonyms:(1S,3S,5S)-2-[(2S)-2-amino-2-(4-ethyloxan-4-yl)acetyl]-2-azabicyclo[3.1.0]hexane-3-carbonitrile; 2,2,2-trifluoroacetic acid BMS-477118 analogue | Saxagliptin Analogue 10g
TypeSmall organic molecule
Emp. Form.C15H23N3O2
Mol. Mass.277.362
SMILESCCC1(CCOCC1)[C@H](N)C(=O)N1[C@H]2C[C@H]2C[C@H]1C#N