Reaction Details
TargetDipeptidyl peptidase 4
LigandBDBM11544
Substrate/CompetitorBDBM11526
Meas. Tech.In Vitro DPP-IV Inhibition Assays
pH7.4±n/a
Temperature295.15±n/a K
Ki 1.8±0.5 nM
CommentsThe compound did not show any significant inhibition of DPP II at concentration up to 30 uM.
Citation Augeri, DJRobl, JABetebenner, DAMagnin, DRKhanna, ARobertson, JGWang, ASimpkins, LMTaunk, PHuang, QHan, SPAbboa-Offei, BCap, MXin, LTao, LTozzo, EWelzel, GEEgan, DMMarcinkeviciene, JChang, SYBiller, SAKirby, MSParker, RAHamann, LG Discovery and preclinical profile of Saxagliptin (BMS-477118): a highly potent, long-acting, orally active dipeptidyl peptidase IV inhibitor for the treatment of type 2 diabetes. J Med Chem48:5025-37 (2005) 
 
Dipeptidyl peptidase 4
Name:Dipeptidyl peptidase 4
Type:Enzyme
Mol. Mass.:88271.01
Organism:Homo sapiens (Human)
Description:P27487
Residue:766
BDBM11544
BDBM11526
NameBDBM11544
Synonyms:(1S,3S,5S)-2-[(2S)-2-amino-2-(3-fluoroadamantan-1-yl)acetyl]-2-azabicyclo[3.1.0]hexane-3-carbonitrile; 2,2,2-trifluoroacetic acid BMS-477118 | Saxagliptin analogue 30
TypeSmall organic molecule
Emp. Form.C18H24FN3O
Mol. Mass.317.4011
SMILESN[C@H](C(=O)N1[C@H]2C[C@H]2C[C@H]1C#N)C12CC3CC(CC(F)(C3)C1)C2