Reaction Details
TargetCapsid protein
LigandBDBM324403
Substrate/Competitorn/a
Meas. Tech.BDNA-assay
EC50<100±n/a nM
Citation Hartman, GDKuduk, S Derivatives and methods of treating hepatitis B infections US Patent US10189835 Publication Date 1/29/2019
 
Capsid protein
Name:Capsid protein
Type:Enzyme Catalytic Domain
Mol. Mass.:21105.01
Organism:Hepatitis B virus genotype C subtype ayr (isolate Human/Japan/Okamoto/-) (HBV-C)
Description:n/a
Residue:183
BDBM324403
NameBDBM324403
Synonyms:US10189835, Compound 434
TypeSmall organic molecule
Emp. Form.C16H18ClN5O3
Mol. Mass.363.799
SMILESCON(C)C(=O)c1n[nH]c2CCN(Cc12)C(=O)Nc1cccc(Cl)c1