Reaction Details
TargetCapsid protein
LigandBDBM324408
Substrate/Competitorn/a
Meas. Tech.BDNA-assay
EC50<100±n/a nM
Citation Hartman, GDKuduk, S Derivatives and methods of treating hepatitis B infections US Patent US10189835 Publication Date 1/29/2019
 
Capsid protein
Name:Capsid protein
Type:Enzyme Catalytic Domain
Mol. Mass.:21105.01
Organism:Hepatitis B virus genotype C subtype ayr (isolate Human/Japan/Okamoto/-) (HBV-C)
Description:n/a
Residue:183
BDBM324408
NameBDBM324408
Synonyms:US10189835, Compound 599
TypeSmall organic molecule
Emp. Form.C17H20ClN5O3
Mol. Mass.377.825
SMILESCCON(C)C(=O)c1n[nH]c2CCN(Cc12)C(=O)Nc1cccc(Cl)c1