Reaction Details
TargetCapsid protein
LigandBDBM324426
Substrate/Competitorn/a
Meas. Tech.BDNA-assay
EC50<500±n/a nM
Citation Hartman, GDKuduk, S Derivatives and methods of treating hepatitis B infections US Patent US10189835 Publication Date 1/29/2019
 
Capsid protein
Name:Capsid protein
Type:Enzyme Catalytic Domain
Mol. Mass.:21105.01
Organism:Hepatitis B virus genotype C subtype ayr (isolate Human/Japan/Okamoto/-) (HBV-C)
Description:n/a
Residue:183
BDBM324426
NameBDBM324426
Synonyms:US10189835, Compound 912
TypeSmall organic molecule
Emp. Form.C19H23ClN6O3
Mol. Mass.418.877
SMILESCN(OC1CN(C)C1)C(=O)c1n[nH]c2CCN(Cc12)C(=O)Nc1cccc(Cl)c1