Reaction Details
TargetDipeptidyl peptidase 4
LigandBDBM11578
Substrate/CompetitorBDBM11561
Meas. Tech.Fluorogenic Assay
IC50 10±n/a nM
Citation Peters, JUWeber, SKritter, SWeiss, PWallier, ABoehringer, MHennig, MKuhn, BLoeffler, BM Aminomethylpyrimidines as novel DPP-IV inhibitors: a 10(5)-fold activity increase by optimization of aromatic substituents. Bioorg Med Chem Lett14:1491-3 (2004) 
 
Dipeptidyl peptidase 4
Name:Dipeptidyl peptidase 4
Type:Enzyme
Mol. Mass.:88271.01
Organism:Homo sapiens (Human)
Description:P27487
Residue:766
BDBM11578
BDBM11561
NameBDBM11578
Synonyms:5-(aminomethyl)-6-(2,4-dichlorophenyl)-2-phenylpyrimidin-4-amine CHEMBL36020
TypeSmall organic molecule
Emp. Form.C17H14Cl2N4
Mol. Mass.345.226
SMILESNCc1c(N)nc(nc1-c1ccc(Cl)cc1Cl)-c1ccccc1