Reaction Details
TargetDipeptidyl peptidase 4
LigandBDBM11593
Substrate/CompetitorBDBM11561
Meas. Tech.Fluorogenic Assay
IC50 0.1±n/a nM
Citation Peters, JUWeber, SKritter, SWeiss, PWallier, ABoehringer, MHennig, MKuhn, BLoeffler, BM Aminomethylpyrimidines as novel DPP-IV inhibitors: a 10(5)-fold activity increase by optimization of aromatic substituents. Bioorg Med Chem Lett14:1491-3 (2004) 
 
Dipeptidyl peptidase 4
Name:Dipeptidyl peptidase 4
Type:Enzyme
Mol. Mass.:88271.01
Organism:Homo sapiens (Human)
Description:P27487
Residue:766
BDBM11593
BDBM11561
NameBDBM11593
Synonyms:5-(aminomethyl)-6-(2,4-dichlorophenyl)-2-(3,5-dimethoxyphenyl)pyrimidin-4-amine | Aminomethylpyrimidine 1e
TypeSmall organic molecule
Emp. Form.C19H18Cl2N4O2
Mol. Mass.405.278
SMILESCOc1cc(OC)cc(c1)-c1nc(N)c(CN)c(n1)-c1ccc(Cl)cc1Cl