Reaction Details
TargetCarbonic anhydrase 1
LigandBDBM10882
Substrate/CompetitorBDBM10856
Meas. Tech.CA Inhibition Assay
pH7.5±n/a
Temperature295.15±n/a K
Ki 25±n/a nM
Citation Ilies, MAVullo, DPastorek, JScozzafava, AIlies, MCaproiu, MTPastorekova, SSupuran, CT Carbonic anhydrase inhibitors. Inhibition of tumor-associated isozyme IX by halogenosulfanilamide and halogenophenylaminobenzolamide derivatives. J Med Chem46:2187-96 (2003) 
 
Carbonic anhydrase 1
Name:Carbonic anhydrase 1
Type:Enzyme
Mol. Mass.:28873.37
Organism:Homo sapiens (Human)
Description:P00915
Residue:261
BDBM10882
BDBM10856
NameBDBM10882
Synonyms:6-ethoxy-1,3-benzothiazole-2-sulfonamide Ethamide Ethoxzolamide Ethoxzolamide, EZM US10172837, Ethoxyzolamide | sulfonamide 3
TypeSmall organic molecule
Emp. Form.C9H10N2O3S2
Mol. Mass.258.317
SMILESCCOc1ccc2nc(sc2c1)S(N)(=O)=O