Reaction Details
TargetCarbonic anhydrase 1
LigandBDBM11629
Substrate/CompetitorBDBM10856
Meas. Tech.CA Inhibition Assay
Ki 1.3±n/a nM
Citation Ilies, MAVullo, DPastorek, JScozzafava, AIlies, MCaproiu, MTPastorekova, SSupuran, CT Carbonic anhydrase inhibitors. Inhibition of tumor-associated isozyme IX by halogenosulfanilamide and halogenophenylaminobenzolamide derivatives. J Med Chem46:2187-96 (2003) 
 
Carbonic anhydrase 1
Name:Carbonic anhydrase 1
Type:Enzyme
Mol. Mass.:28873.37
Organism:Homo sapiens (Human)
Description:P00915
Residue:261
BDBM11629
BDBM10856
NameBDBM11629
Synonyms:2-N-(4-amino-3-bromo-5-chlorobenzene)-1,3,4-thiadiazole-2,5-disulfonamide aminobenzolamide 22
TypeSmall organic molecule
Emp. Form.C8H7BrClN5O4S3
Mol. Mass.448.724
SMILESNc1c(Cl)cc(cc1Br)S(=O)(=O)Nc1nnc(s1)S(N)(=O)=O