Reaction Details
TargetCarbonic anhydrase 4
LigandBDBM11617
Substrate/CompetitorBDBM10856
Meas. Tech.CA Inhibition Assay
Ki 4.2±n/a nM
Citation Ilies, MAVullo, DPastorek, JScozzafava, AIlies, MCaproiu, MTPastorekova, SSupuran, CT Carbonic anhydrase inhibitors. Inhibition of tumor-associated isozyme IX by halogenosulfanilamide and halogenophenylaminobenzolamide derivatives. J Med Chem46:2187-96 (2003) 
 
Carbonic anhydrase 4
Name:Carbonic anhydrase 4
Type:Enzyme
Mol. Mass.:35152.74
Organism:Bos taurus (bovine)
Description:Bovine isozyme, isolated from lung microsomes
Residue:312
BDBM11617
BDBM10856
NameBDBM11617
Synonyms:5-(4-Acetamido-3-chlorobenzenesulfonamido)-1,3,4-thiadiazole-2-sulfonamide aminobenzolamide 16c | aminobenzolamide deriv. 41
TypeSmall organic molecule
Emp. Form.C10H10ClN5O5S3
Mol. Mass.411.865
SMILESCC(=O)Nc1ccc(cc1Cl)S(=O)(=O)Nc1nnc(s1)S(N)(=O)=O