Reaction Details
TargetCarbonic anhydrase 4
LigandBDBM11619
Substrate/CompetitorBDBM10856
Meas. Tech.CA Inhibition Assay
Ki 4.5±n/a nM
Citation Ilies, MAVullo, DPastorek, JScozzafava, AIlies, MCaproiu, MTPastorekova, SSupuran, CT Carbonic anhydrase inhibitors. Inhibition of tumor-associated isozyme IX by halogenosulfanilamide and halogenophenylaminobenzolamide derivatives. J Med Chem46:2187-96 (2003) 
 
Carbonic anhydrase 4
Name:Carbonic anhydrase 4
Type:Enzyme
Mol. Mass.:35152.74
Organism:Bos taurus (bovine)
Description:Bovine isozyme, isolated from lung microsomes
Residue:312
BDBM11619
BDBM10856
NameBDBM11619
Synonyms:5-(4-Acetamido-3-iodobenzenesulfonamido)-1,3,4-thiadiazole-2-sulfonamide aminobenzolamide 16e
TypeSmall organic molecule
Emp. Form.C10H10IN5O5S3
Mol. Mass.503.316
SMILESCC(=O)Nc1ccc(cc1I)S(=O)(=O)Nc1nnc(s1)S(N)(=O)=O