Reaction Details
TargetCarbonic anhydrase 4
LigandBDBM11624
Substrate/CompetitorBDBM10856
Meas. Tech.CA Inhibition Assay
Ki 2.5±n/a nM
Citation Ilies, MAVullo, DPastorek, JScozzafava, AIlies, MCaproiu, MTPastorekova, SSupuran, CT Carbonic anhydrase inhibitors. Inhibition of tumor-associated isozyme IX by halogenosulfanilamide and halogenophenylaminobenzolamide derivatives. J Med Chem46:2187-96 (2003) 
 
Carbonic anhydrase 4
Name:Carbonic anhydrase 4
Type:Enzyme
Mol. Mass.:35152.74
Organism:Bos taurus (bovine)
Description:Bovine isozyme, isolated from lung microsomes
Residue:312
BDBM11624
BDBM10856
NameBDBM11624
Synonyms:2-N-(4-amino-3-iodobenzene)-1,3,4-thiadiazole-2,5-disulfonamide aminobenzolamide 17e
TypeSmall organic molecule
Emp. Form.C8H8IN5O4S3
Mol. Mass.461.28
SMILESNc1ccc(cc1I)S(=O)(=O)Nc1nnc(s1)S(N)(=O)=O