Reaction Details
TargetCarbonic anhydrase 9
LigandBDBM10862
Substrate/CompetitorBDBM10856
Meas. Tech.CA Inhibition Assay
Ki 245±n/a nM
Citation Ilies, MAVullo, DPastorek, JScozzafava, AIlies, MCaproiu, MTPastorekova, SSupuran, CT Carbonic anhydrase inhibitors. Inhibition of tumor-associated isozyme IX by halogenosulfanilamide and halogenophenylaminobenzolamide derivatives. J Med Chem46:2187-96 (2003) 
 
Carbonic anhydrase 9
Name:Carbonic anhydrase 9
Type:Enzyme
Mol. Mass.:49669.03
Organism:Homo sapiens (Human)
Description:Catalytic domain of human cloned isozyme was used in the assay
Residue:459
BDBM10862
BDBM10856
NameBDBM10862
Synonyms:4-Amino-3-fluorobenzenesulfonamide CHEMBL6853 halogenosulfanilamide deriv. 5b
TypeSmall organic molecule
Emp. Form.C6H7FN2O2S
Mol. Mass.190.195
SMILESNc1ccc(cc1F)S(N)(=O)=O