Reaction Details
TargetUbiquitin carboxyl-terminal hydrolase 1
LigandBDBM325048
Substrate/Competitorn/a
Meas. Tech.Ubitquin-Rhodamine 110 Assay for USP1 Activity
IC50<0.002±n/a nM
Citation Buckmelter, AJIoannidis, SFollows, BGustafson, GWang, MCaravella, JAWang, ZFritzen, ELLin, J Purinones as ubiquitin-specific protease 1 inhibitors US Patent US10189841 Publication Date 1/29/2019
 
Ubiquitin carboxyl-terminal hydrolase 1
Name:Ubiquitin carboxyl-terminal hydrolase 1
Type:PROTEIN
Mol. Mass.:88191.62
Organism:Homo sapiens (Human)
Description:ChEMBL_104169
Residue:785
BDBM325048
NameBDBM325048
Synonyms:2-(4-(4-((2-(2-isopropylphenyl)-8-oxo-7,8-dihydro-9H- US10399980, Compound I-254
TypeSmall organic molecule
Emp. Form.C27H26N6O3
Mol. Mass.482.5337
SMILESCC(C)c1ccccc1-c1ncc2[nH]c(=O)n(Cc3ccc(cc3)-c3cnn(C)c3CC(O)=O)c2n1