Reaction Details
TargetUbiquitin carboxyl-terminal hydrolase 1
LigandBDBM325133
Substrate/Competitorn/a
Meas. Tech.Ubitquin-Rhodamine 110 Assay for USP1 Activity
IC50<0.002±n/a nM
Citation Buckmelter, AJIoannidis, SFollows, BGustafson, GWang, MCaravella, JAWang, ZFritzen, ELLin, J Purinones as ubiquitin-specific protease 1 inhibitors US Patent US10189841 Publication Date 1/29/2019
 
Ubiquitin carboxyl-terminal hydrolase 1
Name:Ubiquitin carboxyl-terminal hydrolase 1
Type:PROTEIN
Mol. Mass.:88191.62
Organism:Homo sapiens (Human)
Description:ChEMBL_104169
Residue:785
BDBM325133
NameBDBM325133
Synonyms:9-(4-(4-((dimethylamino)methyl)-1H-1,2,3-triazol-1- US10399980, Compound I-339
TypeSmall organic molecule
Emp. Form.C26H28N8O
Mol. Mass.468.5535
SMILESCC(C)c1ccccc1-c1ncc2[nH]c(=O)n(Cc3ccc(cc3)-n3cc(CN(C)C)nn3)c2n1