Reaction Details
TargetUbiquitin carboxyl-terminal hydrolase 1
LigandBDBM325287
Substrate/Competitorn/a
Meas. Tech.Ubitquin-Rhodamine 110 Assay for USP1 Activity
IC50<0.002±n/a nM
Citation Buckmelter, AJIoannidis, SFollows, BGustafson, GWang, MCaravella, JAWang, ZFritzen, ELLin, J Purinones as ubiquitin-specific protease 1 inhibitors US Patent US10189841 Publication Date 1/29/2019
 
Ubiquitin carboxyl-terminal hydrolase 1
Name:Ubiquitin carboxyl-terminal hydrolase 1
Type:PROTEIN
Mol. Mass.:88191.62
Organism:Homo sapiens (Human)
Description:ChEMBL_104169
Residue:785
BDBM325287
NameBDBM325287
Synonyms:2-(2-isopropylphenyl)-7-methyl-9-((1-(pyrimidin-2- US10399980, Compound I-493 | US11161848, Compound I-493
TypeSmall organic molecule
Emp. Form.C25H29N7O
Mol. Mass.443.5441
SMILESCC(C)c1ccccc1-c1ncc2n(C)c(=O)n(CC3CCN(CC3)c3ncccn3)c2n1