Reaction Details
TargetTyrosine-protein kinase JAK2
LigandBDBM325351
Substrate/Competitorn/a
Meas. Tech.JAK2 Inhibition Assay
IC50<10±n/a nM
Citation Allen, SBoys, MLChicarelli, MJFell, JBFischer, JPGaudino, JHicken, EJHinklin, RJKraser, CFLaird, ERobinson, JETang, TPBurgess, LERieger, RAPheneger, JSatoh, YLeftheris, KRaheja, RKBennett, BL 4,6-substituted-pyrazolo[1,5-a]pyrazines as janus kinase inhibitors US Patent US10189845 Publication Date 1/29/2019
 
Tyrosine-protein kinase JAK2
Name:Tyrosine-protein kinase JAK2
Type:Protein
Mol. Mass.:130684.68
Organism:Homo sapiens (Human)
Description:O60674
Residue:1132
BDBM325351
NameBDBM325351
Synonyms:3-(4-(4-(1-(pentan-3-yl)-1H- pyrazol-4-yl)pyrazolo[1,5- a]pyrazin-6-yl)-1H-pyrazol- 1-yl)thietane 1,1-dioxide US10730880, Example 13 | US11028093, Example 13
TypeSmall organic molecule
Emp. Form.C20H23N7O2S
Mol. Mass.425.507
SMILESCCC(CC)n1cc(cn1)-c1nc(cn2nccc12)-c1cnn(c1)C1CS(=O)(=O)C1