Reaction Details
TargetNon-receptor tyrosine-protein kinase TYK2
LigandBDBM325489
Substrate/Competitorn/a
Meas. Tech.Tyk2 Inhibition Assay
IC50 55±n/a nM
Citation Allen, SBoys, MLChicarelli, MJFell, JBFischer, JPGaudino, JHicken, EJHinklin, RJKraser, CFLaird, ERobinson, JETang, TPBurgess, LERieger, RAPheneger, JSatoh, YLeftheris, KRaheja, RKBennett, BL 4,6-substituted-pyrazolo[1,5-a]pyrazines as janus kinase inhibitors US Patent US10189845 Publication Date 1/29/2019
 
Non-receptor tyrosine-protein kinase TYK2
Name:Non-receptor tyrosine-protein kinase TYK2
Type:Protein
Mol. Mass.:133666.03
Organism:Homo sapiens (Human)
Description:P29597
Residue:1187
BDBM325489
NameBDBM325489
Synonyms:US10189845, Example 151B US11028093, Example 151
TypeSmall organic molecule
Emp. Form.C22H27N7O2
Mol. Mass.421.4955
SMILESC[C@@H]1CCCC[C@H]1n1cc(cn1)-c1nc(cn2nccc12)-c1cnn(C[C@@H](O)CO)c1