Reaction Details
TargetTyrosine-protein kinase JAK1
LigandBDBM325495
Substrate/Competitorn/a
Meas. Tech.JAK1 Inhibition Assay
IC50 55±n/a nM
Citation Allen, SBoys, MLChicarelli, MJFell, JBFischer, JPGaudino, JHicken, EJHinklin, RJKraser, CFLaird, ERobinson, JETang, TPBurgess, LERieger, RAPheneger, JSatoh, YLeftheris, KRaheja, RKBennett, BL 4,6-substituted-pyrazolo[1,5-a]pyrazines as janus kinase inhibitors US Patent US10189845 Publication Date 1/29/2019
 
Tyrosine-protein kinase JAK1
Name:Tyrosine-protein kinase JAK1
Type:Protein
Mol. Mass.:133293.73
Organism:Homo sapiens (Human)
Description:P23458
Residue:1154
BDBM325495
NameBDBM325495
Synonyms:US10189845, Example 157A US11028093, Example 157
TypeSmall organic molecule
Emp. Form.C21H27N7O
Mol. Mass.393.4854
SMILESCCC(CC)n1cc(cn1)-c1nc(cn2nccc12)-c1cnn(c1)[C@@H](C)[C@@H](C)O