Reaction Details
TargetNon-receptor tyrosine-protein kinase TYK2
LigandBDBM325514
Substrate/Competitorn/a
Meas. Tech.Tyk2 Inhibition Assay
IC50<10±n/a nM
Citation Allen, SBoys, MLChicarelli, MJFell, JBFischer, JPGaudino, JHicken, EJHinklin, RJKraser, CFLaird, ERobinson, JETang, TPBurgess, LERieger, RAPheneger, JSatoh, YLeftheris, KRaheja, RKBennett, BL 4,6-substituted-pyrazolo[1,5-a]pyrazines as janus kinase inhibitors US Patent US10189845 Publication Date 1/29/2019
 
Non-receptor tyrosine-protein kinase TYK2
Name:Non-receptor tyrosine-protein kinase TYK2
Type:Protein
Mol. Mass.:133666.03
Organism:Homo sapiens (Human)
Description:P29597
Residue:1187
BDBM325514
NameBDBM325514
Synonyms:2-hydroxy-2-methyl-1-(3- (4-(4-(1-(pentan-3-yl)- 1H-pyrazol-4- yl)pyrazolo[1,5- a]pyrazin-6-yl)-1H- pyrazol-1-yl)azetidin-1- yl)propan-1-one US10730880, Example 176 | US11028093, Example 176
TypeSmall organic molecule
Emp. Form.C24H30N8O2
Mol. Mass.462.5474
SMILESCCC(CC)n1cc(cn1)-c1nc(cn2nccc12)-c1cnn(c1)C1CN(C1)C(=O)C(C)(C)O