Reaction Details
TargetMuscarinic acetylcholine receptor M3
LigandBDBM325609
Substrate/Competitorn/a
Meas. Tech.M3 Binding Assay
Ki 0.850±n/a nM
Citation Amari, GArmani, EBlackaby, WVan De Poeol, HBaker-Glenn, CTrivedi, N Aminoester derivatives US Patent US9636336 Publication Date 5/2/2017
 
Muscarinic acetylcholine receptor M3
Name:Muscarinic acetylcholine receptor M3
Type:Enzyme
Mol. Mass.:66151.03
Organism:Homo sapiens (Human)
Description:P20309
Residue:590
BDBM325609
NameBDBM325609
Synonyms:US9636336, Example 105 US9636336, Example 35 | [(1S)-2-(3,5-dichloro-1-oxido-pyridin-1-ium-4-yl)-1-(3,4-dimethoxyphenyl)ethyl]5-[[[1-(hydroxymethyl)-2-[(1-methyl-4-piperidyl)methoxy]-2-oxo-1-phenyl-ethyl]amino]methyl]thiophene-2-carboxylate
TypeSmall organic molecule
Emp. Form.C37H41Cl2N3O8S
Mol. Mass.758.708
SMILESCOc1ccc(cc1OC)[C@H](Cc1c(Cl)c[n+]([O-])cc1Cl)OC(=O)c1ccc(CNC(CO)(C(=O)OCC2CCN(C)CC2)c2ccccc2)s1