Reaction Details
TargetMuscarinic acetylcholine receptor M3
LigandBDBM325610
Substrate/Competitorn/a
Meas. Tech.M3 Binding Assay
Ki 0.230±n/a nM
Citation Amari, GArmani, EBlackaby, WVan De Poeol, HBaker-Glenn, CTrivedi, N Aminoester derivatives US Patent US9636336 Publication Date 5/2/2017
 
Muscarinic acetylcholine receptor M3
Name:Muscarinic acetylcholine receptor M3
Type:Enzyme
Mol. Mass.:66151.03
Organism:Homo sapiens (Human)
Description:P20309
Residue:590
BDBM325610
NameBDBM325610
Synonyms:US9636336, Example 105c
TypeSmall organic molecule
Emp. Form.C36H39Cl2N3O8S
Mol. Mass.744.681
SMILESCOc1ccc(cc1OC)[C@H](Cc1c(Cl)c[n+]([O-])cc1Cl)OC(=O)c1ccc(CNC(CO)(C(=O)OC2CCN(C)CC2)c2ccccc2)s1