Reaction Details
TargetMetabotropic glutamate receptor 2
LigandBDBM213110
Substrate/Competitorn/a
Meas. Tech.Biological Assay
IC50 5.00±n/a nM
Citation Bungard, CJConverso, ADe Leon, PHanney, BHartingh, TJManikowski, JJManley, PJMeissner, RMeng, ZPerkins, JJRudd, MTShu, Y Quinoline carboxamide and quinoline carbonitrile derivatives as mGluR2-negative allosteric modulators, compositions, and their use US Patent US9636337 Publication Date 5/2/2017
 
Metabotropic glutamate receptor 2
Name:Metabotropic glutamate receptor 2
Type:Enzyme
Mol. Mass.:95584.88
Organism:Homo sapiens (Human)
Description:Q14416
Residue:872
BDBM213110
NameBDBM213110
Synonyms:US9278960, 8-17 US9636337, 8-18
TypeSmall organic molecule
Emp. Form.C23H18FN3O2
Mol. Mass.387.4063
SMILESNC(=O)c1cc(-c2ccc(F)cc2)c2ccc(cc2n1)C(O)Cc1cccnc1