Reaction Details
TargetMetabotropic glutamate receptor 2
LigandBDBM213126
Substrate/Competitorn/a
Meas. Tech.Biological Assay
IC50 6.00±n/a nM
Citation Bungard, CJConverso, ADe Leon, PHanney, BHartingh, TJManikowski, JJManley, PJMeissner, RMeng, ZPerkins, JJRudd, MTShu, Y Quinoline carboxamide and quinoline carbonitrile derivatives as mGluR2-negative allosteric modulators, compositions, and their use US Patent US9636337 Publication Date 5/2/2017
 
Metabotropic glutamate receptor 2
Name:Metabotropic glutamate receptor 2
Type:Enzyme
Mol. Mass.:95584.88
Organism:Homo sapiens (Human)
Description:Q14416
Residue:872
BDBM213126
NameBDBM213126
Synonyms:US9278960, 8-33 | US9636337, 8-33
TypeSmall organic molecule
Emp. Form.C24H18FN5O2
Mol. Mass.427.4304
SMILESCOc1ccc(c(F)c1)-c1cc(nc2cc(CCc3cnc(nc3)C#N)ccc12)C(N)=O