Reaction Details
TargetDipeptidyl peptidase 4
LigandBDBM11644
Substrate/CompetitorBDBM11057
Meas. Tech.DPP Inhibition Assay
pH7.5±n/a
Temperature295.15±n/a K
Ki 1±n/a nM
Citation Longenecker, KLStewart, KDMadar, DJJakob, CGFry, EHWilk, SLin, CWBallaron, SJStashko, MALubben, THYong, HPireh, DPei, ZBasha, FWiedeman, PEvon Geldern, TWTrevillyan, JMStoll, VS Crystal structures of DPP-IV (CD26) from rat kidney exhibit flexible accommodation of peptidase-selective inhibitors. Biochemistry45:7474-82 (2006) 
 
Dipeptidyl peptidase 4
Name:Dipeptidyl peptidase 4
Type:Enzyme
Mol. Mass.:88084.94
Organism:Rattus norvegicus (rat)
Description:n/a
Residue:767
BDBM11644
BDBM11057
NameBDBM11644
Synonyms:(2S)-1-[(2S)-2-amino-2-cyclopentylacetyl]pyrrolidine-2-carbonitrile cyanopyrrolidine deriv. 3
TypeSmall organic molecule
Emp. Form.C12H19N3O
Mol. Mass.221.2988
SMILESN[C@@H](C1CCCC1)C(=O)N1CCC[C@H]1C#N