Reaction Details
TargetDipeptidyl peptidase 8
LigandBDBM11644
Substrate/CompetitorBDBM11057
Meas. Tech.DPP Inhibition Assay
pH7.5±n/a
Temperature295.15±n/a K
Ki 4±n/a nM
Citation Longenecker, KLStewart, KDMadar, DJJakob, CGFry, EHWilk, SLin, CWBallaron, SJStashko, MALubben, THYong, HPireh, DPei, ZBasha, FWiedeman, PEvon Geldern, TWTrevillyan, JMStoll, VS Crystal structures of DPP-IV (CD26) from rat kidney exhibit flexible accommodation of peptidase-selective inhibitors. Biochemistry45:7474-82 (2006) 
 
Dipeptidyl peptidase 8
Name:Dipeptidyl peptidase 8
Type:Enzyme
Mol. Mass.:103342.62
Organism:Homo sapiens (Human)
Description:Q6V1X1
Residue:898
BDBM11644
BDBM11057
NameBDBM11644
Synonyms:(2S)-1-[(2S)-2-amino-2-cyclopentylacetyl]pyrrolidine-2-carbonitrile cyanopyrrolidine deriv. 3
TypeSmall organic molecule
Emp. Form.C12H19N3O
Mol. Mass.221.2988
SMILESN[C@@H](C1CCCC1)C(=O)N1CCC[C@H]1C#N