Reaction Details
TargetDipeptidyl peptidase 4
LigandBDBM11665
Substrate/CompetitorBDBM11057
Meas. Tech.Dipeptidyl Peptidase Inhibition Assay
IC50 8±n/a nM
Citation Xu, JWei, LMathvink, RJEdmondson, SDEiermann, GJHe, HLeone, JFLeiting, BLyons, KAMarsilio, FPatel, RAPatel, SBPetrov, AScapin, GWu, JKThornberry, NAWeber, AE Discovery of potent, selective, and orally bioavailable oxadiazole-based dipeptidyl peptidase IV inhibitors. Bioorg Med Chem Lett16:5373-7 (2006) 
 
Dipeptidyl peptidase 4
Name:Dipeptidyl peptidase 4
Type:Enzyme
Mol. Mass.:88271.01
Organism:Homo sapiens (Human)
Description:P27487
Residue:766
BDBM11665
BDBM11057
NameBDBM11665
Synonyms:N-(4-{5-[(2S,3S)-3-amino-4-oxo-4-(pyrrolidin-1-yl)butan-2-yl]-1,2,4-oxadiazol-3-yl}-3-chlorophenyl)methanesulfonamide oxadiazole based amide
TypeSmall organic molecule
Emp. Form.C17H22ClN5O4S
Mol. Mass.427.906
SMILESC[C@@H]([C@H](N)C(=O)N1CCCC1)c1nc(no1)-c1ccc(NS(C)(=O)=O)cc1Cl