Reaction Details
TargetDipeptidyl peptidase 4
LigandBDBM11679
Substrate/CompetitorBDBM11057
Meas. Tech.Dipeptidyl Peptidase Inhibition Assay
IC50 52±n/a nM
Citation Xu, JWei, LMathvink, RJEdmondson, SDEiermann, GJHe, HLeone, JFLeiting, BLyons, KAMarsilio, FPatel, RAPatel, SBPetrov, AScapin, GWu, JKThornberry, NAWeber, AE Discovery of potent, selective, and orally bioavailable oxadiazole-based dipeptidyl peptidase IV inhibitors. Bioorg Med Chem Lett16:5373-7 (2006) 
 
Dipeptidyl peptidase 4
Name:Dipeptidyl peptidase 4
Type:Enzyme
Mol. Mass.:88271.01
Organism:Homo sapiens (Human)
Description:P27487
Residue:766
BDBM11679
BDBM11057
NameBDBM11679
Synonyms:(2S,3S)-4-cyclopropyl-1-[(3S)-3-fluoropyrrolidin-1-yl]-3-[3-(4-methanesulfonylphenyl)-1,2,4-oxadiazol-5-yl]-1-oxobutan-2-aminium; 2,2,2-trifluoroacetate oxadiazole based amide
TypeSmall organic molecule
Emp. Form.C20H26FN4O4S
Mol. Mass.437.508
SMILESCS(=O)(=O)c1ccc(cc1)-c1noc(n1)[C@@H](CC1CC1)[C@H]([NH3+])C(=O)N1CC[C@H](F)C1