Reaction Details
TargetPhosphatidylinositol 4,5-bisphosphate 3-kinase catalytic subunit gamma isoform
LigandBDBM326258
Substrate/Competitorn/a
Meas. Tech.Inhibition Assay
IC50 0.900±n/a nM
Citation Ruan, F Heterocyclic compounds as inhibitors of class I PI3KS US Patent US9637488 Publication Date 5/2/2017
 
Phosphatidylinositol 4,5-bisphosphate 3-kinase catalytic subunit gamma isoform
Name:Phosphatidylinositol 4,5-bisphosphate 3-kinase catalytic subunit gamma isoform
Type:Enzyme Subunit
Mol. Mass.:126470.30
Organism:Homo sapiens (Human)
Description:P48736
Residue:1102
BDBM326258
NameBDBM326258
Synonyms:US9637488, 17
TypeSmall organic molecule
Emp. Form.C24H26FN7
Mol. Mass.431.5085
SMILESCc1nc(N2CCCC2c2cc3ccc(F)cc3nc2N2CCCCC2)c2[nH]cnc2n1