Reaction Details
TargetMuscarinic acetylcholine receptor M3
LigandBDBM193791
Substrate/Competitorn/a
Meas. Tech.Receptor Selection and Amplification Assays
EC50 130±n/a nM
Citation Burstein, ESEskildsen, JOlsson, R Muscarinic agonists US Patent US9670209 Publication Date 6/6/2017
 
Muscarinic acetylcholine receptor M3
Name:Muscarinic acetylcholine receptor M3
Type:Enzyme
Mol. Mass.:66151.03
Organism:Homo sapiens (Human)
Description:P20309
Residue:590
BDBM193791
NameBDBM193791
Synonyms:US9670209, Compound 309 1-((R)-3-(3-(2-Methoxyethyl)-8-aza-bicyclo[3.2.1]octan-8-yl)-2-methylpropyl)-6-fluoro-1H-indazole
TypeSmall organic molecule
Emp. Form.C21H30FN3O
Mol. Mass.359.4808
SMILESCOCC[C@@H]1C[C@@H]2CC[C@H](C1)N2C[C@@H](C)Cn1ncc2ccc(F)cc12