Reaction Details
TargetMuscarinic acetylcholine receptor M3
LigandBDBM193834
Substrate/Competitorn/a
Meas. Tech.Receptor Selection and Amplification Assays
EC50 79±n/a nM
Citation Burstein, ESEskildsen, JOlsson, R Muscarinic agonists US Patent US9670209 Publication Date 6/6/2017
 
Muscarinic acetylcholine receptor M3
Name:Muscarinic acetylcholine receptor M3
Type:Enzyme
Mol. Mass.:66151.03
Organism:Homo sapiens (Human)
Description:P20309
Residue:590
BDBM193834
NameBDBM193834
Synonyms:US9670209, Comparative compound 2
TypeSmall organic molecule
Emp. Form.C12H21NO3
Mol. Mass.227.3
SMILESCC(C)(C)OC(=O)N1C2CC[C@H]1C[C@@H](O)C2