Reaction Details
TargetDipeptidyl peptidase 4
LigandBDBM11464
Substrate/CompetitorBDBM11526
Meas. Tech.Dipeptidyl Peptidase Inhibition Assay
pH8±n/a
Temperature310.15±n/a K
IC50 1660±230 nM
Citation Tsu, HChen, XChen, CTLee, SJChang, CNKao, KHCoumar, MSYeh, YTChien, CHWang, HSLin, KTChang, YYWu, SHChen, YSLu, ILWu, SYTsai, TYChen, WCHsieh, HPChao, YSJiaang, WT 2-[3-[2-[(2S)-2-Cyano-1-pyrrolidinyl]-2-oxoethylamino]-3-methyl-1-oxobutyl]-1,2,3,4-tetrahydroisoquinoline: a potent, selective, and orally bioavailable dipeptide-derived inhibitor of dipeptidyl peptidase IV. J Med Chem49:373-80 (2006) 
 
Dipeptidyl peptidase 4
Name:Dipeptidyl peptidase 4
Type:Enzyme
Mol. Mass.:88271.01
Organism:Homo sapiens (Human)
Description:P27487
Residue:766
BDBM11464
BDBM11526
NameBDBM11464
Synonyms:(2S,3S)-2-amino-3-methyl-1-(1,3-thiazolidin-3-yl)pentan-1-one CHEMBL98408 thiazolidide 2
TypeSmall organic molecule
Emp. Form.C9H18N2OS
Mol. Mass.202.317
SMILESCC[C@H](C)[C@H](N)C(=O)N1CCSC1