Reaction Details
TargetDipeptidyl peptidase 4
LigandBDBM11717
Substrate/CompetitorBDBM11526
Meas. Tech.Dipeptidyl Peptidase Inhibition Assay
IC50 30±n/a nM
Citation Tsu, HChen, XChen, CTLee, SJChang, CNKao, KHCoumar, MSYeh, YTChien, CHWang, HSLin, KTChang, YYWu, SHChen, YSLu, ILWu, SYTsai, TYChen, WCHsieh, HPChao, YSJiaang, WT 2-[3-[2-[(2S)-2-Cyano-1-pyrrolidinyl]-2-oxoethylamino]-3-methyl-1-oxobutyl]-1,2,3,4-tetrahydroisoquinoline: a potent, selective, and orally bioavailable dipeptide-derived inhibitor of dipeptidyl peptidase IV. J Med Chem49:373-80 (2006) 
 
Dipeptidyl peptidase 4
Name:Dipeptidyl peptidase 4
Type:Enzyme
Mol. Mass.:88271.01
Organism:Homo sapiens (Human)
Description:P27487
Residue:766
BDBM11717
BDBM11526
NameBDBM11717
Synonyms:(2S)-1-(2-{[4-(6-fluoro-1,2,3,4-tetrahydroisoquinolin-2-yl)-2-methyl-4-oxobutan-2-yl]amino}acetyl)pyrrolidine-2-carbonitrile 2-[3-[2-[2-Cyano-(S)-pyrrolidin-1-yl]-2-oxoethylamino]-3-methyl-1-oxobutyl]-6-fluoro-1,2,3,4-tetrahydroisoquinoline
TypeSmall organic molecule
Emp. Form.C21H27FN4O2
Mol. Mass.386.4631
SMILESCC(C)(CC(=O)N1CCc2cc(F)ccc2C1)NCC(=O)N1CCC[C@H]1C#N