Reaction Details
TargetDipeptidyl peptidase 8
LigandBDBM11701
Substrate/CompetitorBDBM11526
Meas. Tech.Dipeptidyl Peptidase Inhibition Assay
IC50 202±n/a nM
Citation Tsu, HChen, XChen, CTLee, SJChang, CNKao, KHCoumar, MSYeh, YTChien, CHWang, HSLin, KTChang, YYWu, SHChen, YSLu, ILWu, SYTsai, TYChen, WCHsieh, HPChao, YSJiaang, WT 2-[3-[2-[(2S)-2-Cyano-1-pyrrolidinyl]-2-oxoethylamino]-3-methyl-1-oxobutyl]-1,2,3,4-tetrahydroisoquinoline: a potent, selective, and orally bioavailable dipeptide-derived inhibitor of dipeptidyl peptidase IV. J Med Chem49:373-80 (2006) 
 
Dipeptidyl peptidase 8
Name:Dipeptidyl peptidase 8
Type:Enzyme
Mol. Mass.:103342.62
Organism:Homo sapiens (Human)
Description:Q6V1X1
Residue:898
BDBM11701
BDBM11526
NameBDBM11701
Synonyms:(2S)-1-{2-[(3-{4-[(3,5-difluorophenyl)carbonyl]piperazin-1-yl}-3-oxopropyl)amino]acetyl}pyrrolidine-2-carbonitrile 1-[3-[2-[2-Cyano-(S)-pyrrolidin-1-yl]-2-oxoethylamino]-1-oxo-propyl]-4-[3,5-difluorobenzoyl]piperazine
TypeSmall organic molecule
Emp. Form.C21H25F2N5O3
Mol. Mass.433.4517
SMILESFc1cc(F)cc(c1)C(=O)N1CCN(CC1)C(=O)CCNCC(=O)N1CCC[C@H]1C#N