Reaction Details
TargetDipeptidyl peptidase 8
LigandBDBM11706
Substrate/CompetitorBDBM11526
Meas. Tech.Dipeptidyl Peptidase Inhibition Assay
IC50 2387±n/a nM
Citation Tsu, HChen, XChen, CTLee, SJChang, CNKao, KHCoumar, MSYeh, YTChien, CHWang, HSLin, KTChang, YYWu, SHChen, YSLu, ILWu, SYTsai, TYChen, WCHsieh, HPChao, YSJiaang, WT 2-[3-[2-[(2S)-2-Cyano-1-pyrrolidinyl]-2-oxoethylamino]-3-methyl-1-oxobutyl]-1,2,3,4-tetrahydroisoquinoline: a potent, selective, and orally bioavailable dipeptide-derived inhibitor of dipeptidyl peptidase IV. J Med Chem49:373-80 (2006) 
 
Dipeptidyl peptidase 8
Name:Dipeptidyl peptidase 8
Type:Enzyme
Mol. Mass.:103342.62
Organism:Homo sapiens (Human)
Description:Q6V1X1
Residue:898
BDBM11706
BDBM11526
NameBDBM11706
Synonyms:(2S)-Cyanopyrrolidine analogue 18j 3-[2-(2-Cyano-(S)-pyrrolidin-1-yl)-2-oxoethylamino]-N-(4-nitrobenzyl)propionamide
TypeSmall organic molecule
Emp. Form.C17H21N5O4
Mol. Mass.359.3797
SMILES[O-][N+](=O)c1ccc(CNC(=O)CCNCC(=O)N2CCC[C@H]2C#N)cc1