Reaction Details
TargetRibosomal protein S6 kinase beta-1
LigandBDBM224325
Substrate/Competitorn/a
Meas. Tech.Enzyme Assay
IC50 2.20±n/a nM
Citation Lan, RHuck, BRChen, XDeselm, LCQiu, HXiao, YNeagu, CMochalkin, IJohnson, TL Aminopyrimidine derivatives for use as modulators of kinase activity US Patent US9662330 Publication Date 5/30/2017
 
Ribosomal protein S6 kinase beta-1
Name:Ribosomal protein S6 kinase beta-1
Type:Enzyme
Mol. Mass.:59139.89
Organism:Homo sapiens (Human)
Description:His-tagged S6K1.
Residue:525
BDBM224325
NameBDBM224325
Synonyms:US10080750, Compound 2 US9662330, Compound 2
TypeSmall organic molecule
Emp. Form.C23H24F4N6
Mol. Mass.460.4705
SMILESNCC(N1CCN(CC1)c1ncnc(N)c1-c1ccc(F)cc1)c1ccc(cc1)C(F)(F)F