Reaction Details
TargetCollagenase ColG
LigandBDBM11759
Substrate/CompetitorBDBM11462
Meas. Tech.ChC Enzyme Inhibition Assay
Ki 8±n/a nM
Citation Scozzafava, ASupuran, CT Protease inhibitors. Part 8: synthesis of potent Clostridium histolyticum collagenase inhibitors incorporating sulfonylated L-alanine hydroxamate moieties. Bioorg Med Chem8:637-45 (2000) 
 
Collagenase ColG
Name:Collagenase ColG
Type:Enzyme
Mol. Mass.:126246.16
Organism:Clostridium histolyticum
Description:Q9S0X0
Residue:1118
BDBM11759
BDBM11462
NameBDBM11759
Synonyms:2-{[(2-chlorophenyl)methyl](1,1,2,2,3,3,4,4,5,5,6,6,7,7,8,8,8-heptadecafluorooctane)sulfonamido}-N-hydroxypropanamide | hydroxamate deriv. B5
TypeSmall organic molecule
Emp. Form.C18H12ClF17N2O4S
Mol. Mass.710.79
SMILESCC(N(Cc1ccccc1Cl)S(=O)(=O)C(F)(F)C(F)(F)C(F)(F)C(F)(F)C(F)(F)C(F)(F)C(F)(F)C(F)(F)F)C(=O)NO