Reaction Details
TargetCollagenase ColG
LigandBDBM11781
Substrate/CompetitorBDBM11462
Meas. Tech.ChC Enzyme Inhibition Assay
Ki 9±n/a nM
Citation Scozzafava, ASupuran, CT Protease inhibitors. Part 8: synthesis of potent Clostridium histolyticum collagenase inhibitors incorporating sulfonylated L-alanine hydroxamate moieties. Bioorg Med Chem8:637-45 (2000) 
 
Collagenase ColG
Name:Collagenase ColG
Type:Enzyme
Mol. Mass.:126246.16
Organism:Clostridium histolyticum
Description:Q9S0X0
Residue:1118
BDBM11781
BDBM11462
NameBDBM11781
Synonyms:2-{[(2-chlorophenyl)methyl](3,5-dichloro-2-hydroxybenzene)sulfonamido}-N-hydroxypropanamide | hydroxamate deriv. B27
TypeSmall organic molecule
Emp. Form.C16H15Cl3N2O5S
Mol. Mass.453.725
SMILESCC(N(Cc1ccccc1Cl)S(=O)(=O)c1cc(Cl)cc(Cl)c1O)C(=O)NO