Reaction Details
TargetCollagenase ColG
LigandBDBM11788
Substrate/CompetitorBDBM11462
Meas. Tech.ChC Enzyme Inhibition Assay
Ki 7±n/a nM
Citation Scozzafava, ASupuran, CT Protease inhibitors. Part 8: synthesis of potent Clostridium histolyticum collagenase inhibitors incorporating sulfonylated L-alanine hydroxamate moieties. Bioorg Med Chem8:637-45 (2000) 
 
Collagenase ColG
Name:Collagenase ColG
Type:Enzyme
Mol. Mass.:126246.16
Organism:Clostridium histolyticum
Description:Q9S0X0
Residue:1118
BDBM11788
BDBM11462
NameBDBM11788
Synonyms:2-{[(2-chlorophenyl)methyl](quinoline-8-)sulfonamido}-N-hydroxypropanamide | hydroxamate deriv. B34
TypeSmall organic molecule
Emp. Form.C19H18ClN3O4S
Mol. Mass.419.882
SMILESCC(N(Cc1ccccc1Cl)S(=O)(=O)c1cccc2cccnc12)C(=O)NO